loading
5Comments

Tell us about yourself!

Complete Your Profile
  • ocotran commented on Analogue-Chick's instructable How to Make Musical Floppy Drives10 months ago
    How to Make Musical Floppy Drives

    Keep getting this error message and I saved TimeOne in library:Arduino: 1.6.7 (Windows 10), Board: "Arduino/Genuino Uno"C:\Users\Oscar\Documents\Arduino\Moppy\Moppy.ino:1:22: fatal error: TimerOne.h: No such file or directory #include <TimerOne.h> ^compilation terminated.exit status 1Error compiling. This report would have more information with "Show verbose output during compilation" enabled in File > Preferences.

    Keep getting this error message and I saved TimeOne in library:Arduino: 1.6.7 (Windows 10), Board: "Arduino/Genuino Uno"C:\Users\Oscar\Documents\Arduino\Moppy\Moppy.ino:1:22: fatal error: TimerOne.h: No such file or directory #include <TimerOne.h> ^compilation terminated.exit status 1Error compiling. This report would have more information with "Show verbose output during compilation" enabled in File > Preferences.

    Keep getting this error message and I saved TimeOne in library:Arduino: 1.6.7 (Windows 10), Board: "Arduino/Genuino Uno"C:\Users\Oscar\Documents\Arduino\Moppy\Moppy.ino:1:22: fatal error: TimerOne.h: No such file or directory #include <TimerOne.h> ^compilation terminated.exit status 1Error compiling. This report would have more information with "Show verbose output during compilation" enabled in File > Preferences.

    Keep getting this error message and I saved TimeOne in library:Arduino: 1.6.7 (Windows 10), Board: "Arduino/Genuino Uno"C:\Users\Oscar\Documents\Arduino\Moppy\Moppy.ino:1:22: fatal error: TimerOne.h: No such file or directory #include <TimerOne.h> ^compilation terminated.exit status 1Error compiling. This report would have more information with "Show verbose output during compilation" enabled in File > Preferences.

    View Instructable »