author

AldrinS10

Inbox View Profile
9Comments

Tell us about yourself!

  • AldrinS10 commented on 陳亮's instructable Arduino Selfie Camera

    I get this error message, pls. help...thanksArduino: 1.8.5 (Windows 10), Board: "ESP32 Dev Module, Enabled, Default, 240MHz (WiFi/BT), QIO, 80MHz, 4MB (32Mb), 115200, None"C:\Users\*****\Documents\Arduino\arduino-selfie-camera2\arduino-selfie-camera2.ino: In function 'void setup()':arduino-selfie-camera2:83: error: 'sensor_t {aka struct _sensor}' has no member named 'set_sharpness' s->set_sharpness(s, 2); ^arduino-selfie-camera2:85: error: 'sensor_t {aka struct _sensor}' has no member named 'set_denoise' s->set_denoise(s, true); ^Multiple libraries were found for "SD.h" Used: C:\Users\*****\AppData\Local\Arduino15\packages\esp32\hardware\esp32\1.0.1\libraries\SD Not used: C:\Users\*****\Documents\Arduino\libraries\SDexit status 1'sensor_t {aka struc…

    see more »

    I get this error message, pls. help...thanksArduino: 1.8.5 (Windows 10), Board: "ESP32 Dev Module, Enabled, Default, 240MHz (WiFi/BT), QIO, 80MHz, 4MB (32Mb), 115200, None"C:\Users\*****\Documents\Arduino\arduino-selfie-camera2\arduino-selfie-camera2.ino: In function 'void setup()':arduino-selfie-camera2:83: error: 'sensor_t {aka struct _sensor}' has no member named 'set_sharpness' s->set_sharpness(s, 2); ^arduino-selfie-camera2:85: error: 'sensor_t {aka struct _sensor}' has no member named 'set_denoise' s->set_denoise(s, true); ^Multiple libraries were found for "SD.h" Used: C:\Users\*****\AppData\Local\Arduino15\packages\esp32\hardware\esp32\1.0.1\libraries\SD Not used: C:\Users\*****\Documents\Arduino\libraries\SDexit status 1'sensor_t {aka struct _sensor}' has no member named 'set_sharpness'This report would have more information with"Show verbose output during compilation"option enabled in File -> Preferences.

    View Instructable »
  • AldrinS10 commented on mybotic's instructable Micro SD Card Tutorial

    that might be 4, can't find pin 14 on my uno:-D

    View Instructable »
  • Yes, you can run it using SSH or via VNC. ( sudo weather.py ).

    It works on mine...

    View Instructable »
  • I get error message:Traceback (most recent call last): File "/home/pi/OLED/python-examples/OLEDMem_cpu.py", line 40, in <module> spi = gaugette.spi.SPI(spi_bus, spi_device) File "/usr/local/lib/python2.7/dist-packages/gaugette/spi.py", line 21, in __init__ self.spi.open(bus, device)IOError: [Errno 2] No such file or directoryNeed help. Thanks

    View Instructable »
  • AldrinS10 commented on deba168's instructable ESP8266 Weather Widget

    Hello, I've got error message when uploading...Arduino: 1.8.5 (Windows 7), Board: "NodeMCU 1.0 (ESP-12E Module), 80 MHz, 4M (1M SPIFFS), v2 Prebuilt (MSS=536), Disabled, None, 115200"WARNING: Category '' in library XPT2046 is not valid. Setting to 'Uncategorized'C:\Users\Aldrin\Documents\Arduino\libraries\ssd1306_i2c-master\ssd1306_i2c.c:32:25: fatal error: wiringPiI2C.h: No such file or directory #include <wiringPiI2C.h> ^compilation terminated.exit status 1Error compiling for board NodeMCU 1.0 (ESP-12E Module).This report would have more information with"Show verbose output during compilation"option enabled in File -> Preferences.Pls. help...Thanks

    View Instructable »
  • AldrinS10 made the instructable Arduino Stopwatch