Tell us about yourself!

Complete Your Profile
  • csummers1 commented on sherrycayheyhey's instructable LEGO Hyperbolic Slot6 days ago
    LEGO Hyperbolic Slot

    Where are this instructions?

    View Instructable »
  • csummers1 made the instructable Making Simple PVC Flutes2 years ago
    Making Simple PVC Flutes

    I built a flute with the instructions. I think it is best to read the details several times to get it right. It may be me, but I'm having a hard time getting a consistent tone. I think perhaps a removable mouth piece may be good for experimentation.

    View Instructable »
  • csummers1 commented on HackerBoxes's instructable HackerBoxes 0013: Autosport2 years ago
    HackerBoxes 0013: Autosport

    under Sketch>Include Library pick the correct library you are using. That fixed the problem for me.

    View Instructable »
  • csummers1 commented on HackerBoxes's instructable HackerBoxes 0013: Autosport2 years ago
    HackerBoxes 0013: Autosport

    No. Works great now.

    I had not attached the library to the project. Works fine now. I also wish there was more detail on how to set up the android app. I found out by experimenting and looking at the code that the buttons should be attached to virtual V0-V3, and the two fields for the buttons are the start values and end values (in this case 0 and 1).It works like a champ now. Now on to the next part.

    View Instructable »
  • csummers1 commented on HackerBoxes's instructable HackerBoxes 0013: Autosport2 years ago
    HackerBoxes 0013: Autosport

    I installed the Blynk libraries and now have the errors:Arduino: 1.6.5 (Windows 8.1), Board: "NodeMCU 1.0 (ESP-12E Module), 80 MHz, 115200, 4M (3M SPIFFS)"HBcar:32: error: stray '\' in programHBcar:32: error: stray '\' in programHBcar:33: error: stray '\' in programHBcar:33: error: stray '\' in programHBcar:34: error: stray '\' in programHBcar:34: error: stray '\' in programHBcar:32: error: 'u201cb1d126c6cb3845dcb48778dd007c1d6d' was not declared in this scopeHBcar:33: error: 'u201cCBCI' was not declared in this scopeHBcar:33: error: 'A450' was not declared in this scopeHBcar:34: error: 'u201c0Bstacles' was not declared in this scopestray '\' in program This report would have more information with "Show verbose output during compilation" enabled in File > Prefe...

    see more »

    I installed the Blynk libraries and now have the errors:Arduino: 1.6.5 (Windows 8.1), Board: "NodeMCU 1.0 (ESP-12E Module), 80 MHz, 115200, 4M (3M SPIFFS)"HBcar:32: error: stray '\' in programHBcar:32: error: stray '\' in programHBcar:33: error: stray '\' in programHBcar:33: error: stray '\' in programHBcar:34: error: stray '\' in programHBcar:34: error: stray '\' in programHBcar:32: error: 'u201cb1d126c6cb3845dcb48778dd007c1d6d' was not declared in this scopeHBcar:33: error: 'u201cCBCI' was not declared in this scopeHBcar:33: error: 'A450' was not declared in this scopeHBcar:34: error: 'u201c0Bstacles' was not declared in this scopestray '\' in program This report would have more information with "Show verbose output during compilation" enabled in File > Preferences.

    Where is the file BlynkSimpleEsp8266.h located on your computer? My setup is not finding it, although I have downloaded it.

    I cant seem to get the code to compile.Arduino: 1.6.5 (Windows 8.1), Board: "NodeMCU 1.0 (ESP-12E Module), 80 MHz, 115200, 4M (3M SPIFFS)"FKYC4PQIW6PETMQ.ino:11:32: fatal error: BlynkSimpleEsp8266.h: No such file or directorycompilation terminated.Error compiling.This report would have more information with"Show verbose output during compilation"enabled in File > Preferences.

    View Instructable »