Instructable doesnt appear, only error messages

I just published my new instructable https://www.instructables.com/id/DiskoPigs/, but it doesnt shows, only gives some error messages (see image).

Posted by mischka 7 years ago


Upgrade page to Premium do not work in Safari and Chrome

Hi,  Just tried to upgrade to premium however the page that I am sent to seem to have an error. Link to the page that I'm trying to upgrade from (link) The choices seem to be displayed two times, and clicking the "Sign up" button or the "Premium Account" button at the bottom of the page do nothing.  See screenshot attached. I'm getting the same error in Safari and Chrome. 

Posted by Ctech83 1 year ago


Groups Bug

I cannot seem to remove an instructable from my group.When I click ' Manage this Group' and then click the orange cross on that particular instructable, nothing happens and 'Error on page' is displayed in the IE 8 Status bar.I use IE 8 and Windows XP.Any reasons why ??? Kabir

Posted by mhkabir 9 years ago


My profile says 2 instuctables but 3 are posted

My profile says i only have 2 instructables, but there are 3 posted...

Posted by Rawfully Tempting 6 years ago


Error?! Help please!

ERROR 500: java.lang.IllegalArgumentException: No enum const class com.instructables.model.helper.PublishedStatus. Exceptionjava.lang.IllegalArgumentException: No enum const class com.instructables.model.helper.PublishedStatus. at java.lang.Enum.valueOf(Enum.java:192) at com.instructables.hibernate.EnumUserType.nullSafeGet(EnumUserType.java:41) at org.hibernate.type.CustomType.nullSafeGet(CustomType.java:105) at org.hibernate.type.AbstractType.hydrate(AbstractType.java:81) at org.hibernate.persister.entity.AbstractEntityPersister.hydrate(AbstractEntityPersister.java:2046) at org.hibernate.loader.Loader.loadFromResultSet(Loader.java:1371) at org.hibernate.loader.Loader.instanceNotYetLoaded(Loader.java:1299) at org.hibernate.loader.Loader.getRow(Loader.java:1197) at org.hibernate.loader.Loader.getRowFromResultSet(Loader.java:568) at org.hibernate.loader.Loader.doQuery(Loader.java:689) at org.hibernate.loader.Loader.doQueryAndInitializeNonLazyCollections(Loader.java:224) at org.hibernate.loader.Loader.doList(Loader.java:2211) at org.hibernate.loader.Loader.listIgnoreQueryCache(Loader.java:2095) at org.hibernate.loader.Loader.list(Loader.java:2090) at org.hibernate.loader.custom.CustomLoader.list(CustomLoader.java:289) at org.hibernate.impl.SessionImpl.listCustomQuery(SessionImpl.java:1695) at org.hibernate.impl.AbstractSessionImpl.list(AbstractSessionImpl.java:142) at org.hibernate.impl.SQLQueryImpl.list(SQLQueryImpl.java:150) at com.instructables.manager.HibernateScoreManager.favorites(HibernateScoreManager.java:222) at sun.reflect.GeneratedMethodAccessor568.invoke(Unknown Source) at sun.reflect.DelegatingMethodAccessorImpl.invoke(DelegatingMethodAccessorImpl.java:25) at java.lang.reflect.Method.invoke(Method.java:597) at com.instructables.transaction.TransactionHandler.invoke(TransactionHandler.java:69) at $Proxy12.favorites(Unknown Source) at com.instructables.webapp.you.ShowYou.show(ShowYou.java:179) at com.instructables.servlet.ExploreServlet.doGet(ExploreServlet.java:97) at javax.servlet.http.HttpServlet.service(HttpServlet.java:115) at com.instructables.servlet.InstructHttpServlet.service(InstructHttpServlet.java:37) at javax.servlet.http.HttpServlet.service(HttpServlet.java:92) at com.caucho.server.dispatch.ServletFilterChain.doFilter(ServletFilterChain.java:106) at com.instructables.filter.SecurityFilter.doFilter(SecurityFilter.java:164) at com.caucho.server.dispatch.FilterFilterChain.doFilter(FilterFilterChain.java:70) at com.instructables.filter.HibernateSessionRequestFilter.doFilter(HibernateSessionRequestFilter.java:71) at com.caucho.server.dispatch.FilterFilterChain.doFilter(FilterFilterChain.java:70) at com.caucho.server.webapp.WebAppFilterChain.doFilter(WebAppFilterChain.java:173) at com.caucho.server.dispatch.ServletInvocation.service(ServletInvocation.java:229) at com.caucho.server.http.HttpRequest.handleRequest(HttpRequest.java:274) at com.caucho.server.port.TcpConnection.run(TcpConnection.java:511) at com.caucho.util.ThreadPool.runTasks(ThreadPool.java:520) at com.caucho.util.ThreadPool.run(ThreadPool.java:442) at java.lang.Thread.run(Thread.java:619)What is this?!

Posted by Spl1nt3rC3ll 10 years ago


I can't check threads either - error 500

ERROR 500: javax.servlet.ServletException: javax.servlet.jsp.JspException: ServletException in '/common/layout3col.jspx': ServletException in '/pages/forum/topic_body.jsp': java.lang.reflect.InvocationTargetExceptionExceptionjavax.servlet.ServletException: javax.servlet.jsp.JspException: ServletException in '/common/layout3col.jspx': ServletException in '/pages/forum/topic_body.jsp': java.lang.reflect.InvocationTargetException at com.caucho.jsp.PageContextImpl.handlePageException(PageContextImpl.java:1114) at _jsp._pages._forum._topicjsp._jspService(_topicjsp.java:77) at com.caucho.jsp.JavaPage.service(JavaPage.java:60) at com.caucho.jsp.Page.pageservice(Page.java:570) at com.caucho.server.dispatch.PageFilterChain.doFilter(PageFilterChain.java:179) at com.caucho.server.webapp.DispatchFilterChain.doFilter(DispatchFilterChain.java:115) at com.caucho.server.dispatch.ServletInvocation.service(ServletInvocation.java:229) at com.caucho.server.webapp.RequestDispatcherImpl.include(RequestDispatcherImpl.java:485) at com.caucho.server.webapp.RequestDispatcherImpl.include(RequestDispatcherImpl.java:350) at com.instructables.webapp.forum.ShowForum.show(ShowForum.java:117) at com.instructables.servlet.ExploreServlet.doGet(ExploreServlet.java:97) at javax.servlet.http.HttpServlet.service(HttpServlet.java:115) at com.instructables.servlet.InstructHttpServlet.service(InstructHttpServlet.java:37) at javax.servlet.http.HttpServlet.service(HttpServlet.java:92) at com.caucho.server.dispatch.ServletFilterChain.doFilter(ServletFilterChain.java:106) at com.instructables.filter.SecurityFilter.doFilter(SecurityFilter.java:155) at com.caucho.server.dispatch.FilterFilterChain.doFilter(FilterFilterChain.java:70) at com.instructables.filter.HibernateSessionRequestFilter.doFilter(HibernateSessionRequestFilter.java:71) at com.caucho.server.dispatch.FilterFilterChain.doFilter(FilterFilterChain.java:70) at com.caucho.server.webapp.WebAppFilterChain.doFilter(WebAppFilterChain.java:173) at com.caucho.server.dispatch.ServletInvocation.service(ServletInvocation.java:229) at com.caucho.server.http.HttpRequest.handleRequest(HttpRequest.java:274) at com.caucho.server.port.TcpConnection.run(TcpConnection.java:511) at com.caucho.util.ThreadPool.runTasks(ThreadPool.java:520) at com.caucho.util.ThreadPool.run(ThreadPool.java:442) at java.lang.Thread.run(Thread.java:619)Caused by: javax.servlet.jsp.JspException: ServletException in '/common/layout3col.jspx': ServletException in '/pages/forum/topic_body.jsp': java.lang.reflect.InvocationTargetException at org.apache.tiles.taglib.InsertTag$InsertHandler.doEndTag(InsertTag.java:923) at org.apache.tiles.taglib.InsertTag.doEndTag(InsertTag.java:457) at _jsp._pages._forum._topicjsp._jspService(_topicjsp.java:73) ... 24 moreCaused by: javax.servlet.ServletException: javax.servlet.jsp.JspException: ServletException in '/pages/forum/topic_body.jsp': java.lang.reflect.InvocationTargetException at com.caucho.jsp.PageContextImpl.handlePageException(PageContextImpl.java:1114) at _jsp._common._layout3coljspx._jspService(_layout3coljspx.java:190) at com.caucho.jsp.JavaPage.service(JavaPage.java:60) at com.caucho.jsp.Page.pageservice(Page.java:570) at com.caucho.server.dispatch.PageFilterChain.doFilter(PageFilterChain.java:179) at com.caucho.server.webapp.DispatchFilterChain.doFilter(DispatchFilterChain.java:115) at com.caucho.server.dispatch.ServletInvocation.service(ServletInvocation.java:229) at com.caucho.server.webapp.RequestDispatcherImpl.include(RequestDispatcherImpl.java:485) at com.caucho.server.webapp.RequestDispatcherImpl.include(RequestDispatcherImpl.java:350) at com.caucho.jsp.PageContextImpl.include(PageContextImpl.java:927) at com.caucho.jsp.PageContextImpl.include(PageContextImpl.java:864) at org.apache.tiles.TilesUtilImpl.doInclude(TilesUtilImpl.java:143) at org.apache.tiles.TilesUtil.doInclude(TilesUtil.java:149) at org.apache.tiles.taglib.InsertTag.doInclude(InsertTag.java:760) at org.apache.tiles.taglib.InsertTag$InsertHandler.doEndTag(InsertTag.java:892) ... 26 moreCaused by: javax.servlet.jsp.JspException: ServletException in '/pages/forum/topic_body.jsp': java.lang.reflect.InvocationTargetException at org.apache.tiles.taglib.InsertTag$InsertHandler.doEndTag(InsertTag.java:923) at org.apache.tiles.taglib.InsertTag.doEndTag(InsertTag.java:457) at _jsp._common._layout3coljspx._jspService(_layout3coljspx.java:165) ... 39 moreCaused by: javax.servlet.ServletException: javax.servlet.jsp.el.ELException: java.lang.reflect.InvocationTargetException at com.caucho.jsp.PageContextImpl.handlePageException(PageContextImpl.java:1114) at _jsp._pages._forum._topic_0bodyjsp._jspService(_topic_0bodyjsp.java:142) at com.caucho.jsp.JavaPage.service(JavaPage.java:60) at com.caucho.jsp.Page.pageservice(Page.java:570) at com.caucho.server.dispatch.PageFilterChain.doFilter(PageFilterChain.java:179) at com.caucho.server.webapp.DispatchFilterChain.doFilter(DispatchFilterChain.java:115) at com.caucho.server.dispatch.ServletInvocation.service(ServletInvocation.java:229) at com.caucho.server.webapp.RequestDispatcherImpl.include(RequestDispatcherImpl.java:485) at com.caucho.server.webapp.RequestDispatcherImpl.include(RequestDispatcherImpl.java:350) at com.caucho.jsp.PageContextImpl.include(PageContextImpl.java:927) at com.caucho.jsp.PageContextImpl.include(PageContextImpl.java:864) at org.apache.tiles.TilesUtilImpl.doInclude(TilesUtilImpl.java:143) at org.apache.tiles.TilesUtil.doInclude(TilesUtil.java:149) at org.apache.tiles.taglib.InsertTag.doInclude(InsertTag.java:760) at org.apache.tiles.taglib.InsertTag$InsertHandler.doEndTag(InsertTag.java:892) ... 41 moreCaused by: javax.servlet.jsp.el.ELException: java.lang.reflect.InvocationTargetException at com.caucho.el.StaticMethodExpr.evalMethod(StaticMethodExpr.java:142) at com.caucho.el.FunctionExpr.evalObject(FunctionExpr.java:71) at com.caucho.el.Expr.evalStringNonNull(Expr.java:216) at _jsp._pages._forum._topic_0bodyjsp._jspService(_topic_0bodyjsp.java:89) ... 54 moreCaused by: java.lang.reflect.InvocationTargetException at sun.reflect.GeneratedMethodAccessor128.invoke(Unknown Source) at sun.reflect.DelegatingMethodAccessorImpl.invoke(DelegatingMethodAccessorImpl.java:25) at java.lang.reflect.Method.invoke(Method.java:597) at com.caucho.el.StaticMethodExpr.evalMethod(StaticMethodExpr.java:133) ... 57 moreCaused by: org.hibernate.LazyInitializationException: could not initialize proxy - the owning Session was closed at org.hibernate.proxy.AbstractLazyInitializer.initialize(AbstractLazyInitializer.java:60) at org.hibernate.proxy.AbstractLazyInitializer.getImplementation(AbstractLazyInitializer.java:111) at org.hibernate.proxy.pojo.cglib.CGLIBLazyInitializer.invoke(CGLIBLazyInitializer.java:140) at com.instructables.model.persistent.User$$EnhancerByCGLIB$$3399e775.getScreenName() at com.instructables.taglib.Functions.showURL(Functions.java:64) ... 61 more

Posted by Kiteman 10 years ago


error 500

AHH EVERYTHING GIVES ERROR 500

Posted by Derin 10 years ago


Error 500

What is error 500 etc.... it is very anoying!

Posted by maarchaaa 8 years ago


ERROR 503

Just had several error 503's as in picture whilst answering a question.

Posted by rickharris 7 years ago


What is ERROR 400?

I made a group and it then said that there was an error. I dont know why?

Posted by Aron313 6 years ago


what is error 504??

When i upload an .gif image, it gives error 504. what is it?? doesn't gif image upload??

Posted by creativegirlz 8 years ago


ERROR 500!

Ï»¿I'm having an ERROR 500 almost everytime I visit Your website. Can you help me?

Posted by ponkuz 8 years ago


Error 500 and Error 400

I have tried to make forums but I made too many of the same. What's worst is that they don't let me get rid of them. The first some time they said error 400 but now it says ERROR 500: java.lang.NullPointerException.These are the forums:forum 1forum 2forum 3

Posted by Masterdude 9 years ago


403 error

I note that after your crash I now have a 403 error request forbidden by Admin rules on ALL my instructables. I am unable to see any strange script in the instructables and it didn't do it before. Error!!

Posted by rickharris 7 years ago


Error 500

I can't view links on istructables. I get error 500 massage. If you know how to fix it write me an e-mail. lakruasix@gmail.com

Posted by lakrua 9 years ago


Error 500!!!

Why I get this: ERROR 500: javax.servlet.jsp.JspException: ServletException in '/common/newlayout.jspx': Can't insert page '/pages/explore/newrightbar.jsp' : ISO-8859-10 when I login????

Posted by FoxmanLTU 8 years ago


the error 500

I am getting a lot of ERROR 500: javax.servlet.jsp.JspException: ServletException in '/common/layout3col.jspx': Can't insert page '/pages/solr/explore_body.jsp' : ISO-8859-10 Whats up with that? I tried looking for other topics about that and ironically I got the error again.

Posted by caroliina 9 years ago


Error 500 when deleting own comments

When I try to delete one of my own comments, I get an error page that starts with: ERROR 500: java.lang.NullPointerException Am I not allowed to delete my own comments? Thanks!

Posted by BicycleTutor 9 years ago


Error on page

At the top of the page at: https://www.instructables.comit shows: "YOU INBOX" and I'm pretty sure it ought to be: "YOUR INBOX".

Posted by wolft4292 9 years ago


404 error on instructable

This project (which shows up in a "recent" sort) returns a 404 error, and was doing so yesterday, also:https://www.instructables.com/id/MAKE-A-HIGH-VOLTAGE-SUPPLY-IN-5-MINUTES/

Posted by gmoon 10 years ago


Getting HTTP error on upload

Help! :-) I'm trying to upload a Lego Digital Designer file (.lxf, 18.7kb) and an excel file (.xlsx, 82kb) and I keep getting an HTTP Error. Nothing else is specified about the error. I was able to upload a .jpg to the same instructable.

Posted by FLL_Flaming_Cows 5 years ago


"Stats" box servlet error

Clicking the Stats tab in any instructable triggers a pretty heavy servlet error (and exception list.) Error msg: ERROR 500: javax.servlet.jsp.JspException: An error occurred while evaluating custom action attribute "value" with value "${stats.TotalHits}": Unable to find a value for "TotalHits" in object of class "com.instructables.model.helper.Stats" using operator "." (null) There were some changes added overnight (book contest navigation, above each entry), which might have contributed...

Posted by gmoon 10 years ago


Error 400 when trying to view forums

This may be a problem with the server, or youre just updating it:

Posted by DJ Radio 9 years ago


ERROR 500: javax.servlet.jsp.JspException

I've got ERROR 500 every time when I am looking for some solution even for answers to thislike questions in a help topics. ERROR 500: javax.servlet.jsp.JspException: ServletException in '/pages/forum/forum_layout.jspx': Can't insert page '/pages/forum/topic_rightbar.jsp' : ISO-8859-10

Posted by Mareks 9 years ago


Unable to publish COLLECTION, json error

I am trying to publish a draft collection today but its throwing a json error (see image). I tried in IE10, FF25, Chrome 27.

Posted by Tarun Upadhyaya 5 years ago


"Invalid formatting" error when inserting link

. When trying to insert a (valid) link to http://en.wikipedia.org/wiki/Executive_order_(United_States) , I get the following error msg:Invalid formatting in the comment.. Getting rid of everything after the "r" cleared it up, so I'm assuming it's the parentheses that trip the error.

Posted by NachoMahma 9 years ago


Error 500

Whataheck is this goddamed :D please helo guys becoause it's ugly then on the secont stel of the instruction you see this: ERROR 500: javax.servlet.jsp.JspException: ServletException in '/common/newlayout.jspx': Can't insert page '/pages/explore/newrightbar.jsp' : ISO-8859-10

Posted by quabek 9 years ago


Javax error

Hello, I just wanted to report a problem on one instructable. https://www.instructables.com/id/Go-Green-Sign-for-backpack-using-CD-Case/ if I open this particular one, i can only see loads of weird commands and errors. have a nice day

Posted by djgrinch 7 years ago


error 403

Every few minutes today i have been getting the 403 HTML error "forbidden" "request forbidden by administrative rules"  on instructables its highly frustrating the only solution is to wait a few minutes and then refresh i know the error is just a blanket ACCESS DENIED page and it gives no reasoning even though i know that i am allowed to access the page

Posted by katzmatt 6 years ago


you probably can't post here at the moment but whats with the java error?? is it just me?

Java error...... I can't read posts not even this one!!

Posted by chaoscampbell 10 years ago


Uploading Pictures Error

Hi, Today I tried to make an instructable and I was unable to upload any pictures. I tried a few different kinds of pictures with different extensions and still nothing! This is the error I see: Creek.jpg (258.21KB) - IO Error Also can anyone tell me how to delete drafts of instructables? I only see the edit and publish.... Thank you ahead of time! :)

Posted by cheeriokate 5 years ago


Error Adding to Collection. Please try again.

Everytime I try to add a new instructable to my Collection. I always displays "Error Adding to Collection. Please try again." I created a test collection (unpublished), it works fine. Is there a limit on the number of instructables inside a collection?

Posted by 2elev8 4 years ago


Error 500

Everything is an error 500. Forum topics, instructables, everything, and I can't even search for things! It's been happening since yesterday, I thought it was a server glitch, but it's been happening every time I've viewed something. If anyone manages to find this without getting error 500, I'd appreciate some help with it.

Posted by The Jamalam 8 years ago


Collaboration Feature Error

My partner, who owns the project, added me as a collaborator, but I haven't received any notifications on my inbox. Do you know how I can access the Instructable?

Posted by Aditya Priyadarshi 1 year ago


Goldeneye Wii online Multiplayer Error 51031

We recently switched our internet and TV from Comcast to AT&T. I try to access Nintendo Wi-Fi connnection and it says, "Error 51031, confirm SSID and try again,"  or something like that. I try everything on the web and nothing helps. Please help!!! 

Posted by BLUEBLOBS2 5 years ago


Error adding to collection

I have several collections of little items I like, and lately when I try to add more Instructables to it, it says "error adding to collection". Also I think some of the Instructables have disappeared from my Altoids tins collection. Has anyone else had this problem? Can it be fixed?

Posted by tinyweasel 4 years ago


Can't Re-publish my Instructable

I'm trying to re-publish my instructable: https://www.instructables.com/id/FrankenSolo/ and it won't allow it.  I'm getting the error message: "ERROR 401: edit object EHFJ8VFH7A8PLJ4" Please help!!!

Posted by ridiculously.awesome 5 years ago


ERROR 401: I can't publish my instructable!

I can't publish my instructable because when I hit the publish button, after a very long wait, I get this message: ERROR 401: Not authorized to edit object EMN5N04FSSIUO9O Can anyone tell me if I am doing something wrong or how to fix this? Thanks.

Posted by megmaine 9 years ago


Collection bug

When I try to add an ible to one of my collections, I get an error. Also when I try to unpublish or save the collection the error occures. It's only this one, the other collections are fine. I'm using a mac, 10.6.8 and Firefox, latest version

Posted by Tipple 4 years ago


500 Error when I view my settings

I get an error when I try to view my settings page (/account/settings). I think the site is upset that I am ageless. com.instructables.exception.InstructableRuntimeException: some problem with the settings... at com.instructables.webapp.account.SettingsAction.prepare(SettingsAction.java:235) ... Caused by: java.lang.NullPointerException at com.instructables.model.persistent.User.getAge(User.java:192) at com.instructables.webapp.account.SettingsForm.(SettingsForm.java:58) at com.instructables.webapp.account.SettingsAction.prepare(SettingsAction.java:125) ... 18 more

Posted by aneel 10 years ago


Can't delete unpublished Instructable with Parse Error

I've tried started an Instructable, and made the mistake of including a Portuguese letter in the title (ã). Each time I tried to save this Instructable, it gave me a Syntax Error, and froze. Now I have multiple saved versions of this 'Ible in my unpublished box, and can't delete them, because the same error pops-up. Suggestions?

Posted by Winged Fist 6 years ago


Location link on profile pages leads to errors.

This bug has been around for a while, so it may have already been mentioned, but when visiting the location link on a user's profile page, you get an error.  See here for error: https://www.instructables.com/tag/type-user/location-iowa/ I know you guys are busy with the site layout re-design, so whenever you get a chance you can check this out (It's not a major bug). Thanks for keeping instructables awesome, Awesome-aniac

Posted by Awesome-aniac 6 years ago


Whenever I try to publish my instructable it states ERROR 401: Not authorized to EH55ICZFCEIJ5M7?

Whenever I try to publish my instructable it states ERROR 401: Not authorized to EH55ICZFCEIJ5M7? How do I fix this? This is my first instructable so help will be appreciated

Posted by rypersonboy 10 years ago


Double postings and backend errors

Recently I have massive problems answering questions in the forum. If I press "post" nothing at all happens. After a bit of waiting with still nothing I press "post" again to see a double posting as the result. If there is no double posting I will get "error: backend read error" after about 60 seconds. Operating system is Win7 64, Firefox 31 in use with AdBlock. Checked with Chrome and get the same problem. Edit: tried now for over 30 minutes to post this as the preview only gave me a white page before.

Posted by Downunder35m 4 years ago


Password change

When I go to change my password I but in the old/new/new and hit change password but it co,es back with 'error on page'

Posted by curlymixl9 9 years ago


Error when downloading PDF of "Stop using Ferric Chloride etchant! (A better etching solution.)"

I get this error when clicking the download button on this: https://www.instructables.com/id/Stop-using-Ferric-Chloride-etchant%21--A-better-etc/ happens with  Chrome and Firefox on Windows 7 (note other downloads work fine) ---------------------------- (function(){var c=0;if("undefined"!==typeof CustomEvent&&"function"===typeof window.dispatchEvent){var a=function(a){try{if("object"===typeof a&&(a=JSON.stringify(a)),"string"===typeof a)return window.dispatchEvent(new CustomEvent("lprequeststart",{detail:{data:a,requestID:++c}})),c}catch(f){}},b=function(a){try{window.dispatchEvent(new CustomEvent("lprequestend",{detail:a}))}catch(f){}};"undefined"!==typeof XMLHttpRequest&&XMLHttpRequest.prototype;&&XMLHttpRequest.prototype.send;&&(XMLHttpRequest.prototype.send= function(c){return function(f){var d=this,e=a(f);e&&d.addEventListener;("loadend",function(){b({requestID:e,statusCode:d.status})});return c.apply(d,arguments)}}(XMLHttpRequest.prototype.send));"function"===typeof fetch&&(fetch=function(c){return function(f,d){var e=a(d),g=c.apply(this,arguments);if(e){var h=function(a){b({requestID:e,statusCode:a&&a.status;})};g.then(h)["catch"](h)}return g}}(fetch))}})(); (function(){if("undefined"!==typeof CustomEvent){var c=function(a){if(a.lpsubmit)return a;var b=function(){try{this.dispatchEvent(new CustomEvent("lpsubmit"))}catch(k){}return a.apply(this,arguments)};b.lpsubmit=!0;return b};window.addEventListener("DOMContentLoaded",function(){if(document&&document.forms;&&0 AccessDenied Access Denied 07BB2BDF001C8E39 UNsh+3Qc6mUeOnVk7FiMOvXWaiu+9vpA24ZxkR6/TCCRjKqR0A9UsViskbkpNlWgADghstM9XYo=

Posted by newline 1 year ago


Error:No files.

I was putting the finishing touches on my newest instructable  and when I try to upload the photos that I need it says "Error: No files." Anyone know a workaround?

Posted by bravoechonovember1 2 years ago


Can't edit collection

I published a new collection.  During the time it took to publish it, I got "an error has occurred".  Now when I go into the collection and hit edit or try to add an additional page to the collection, I get "Something unexpected happened! If the error keeps occurring, file a bug report!"

Posted by mlarussa 3 years ago


Errors in PDF Download

I just created my first instructable. After publishing, I downloaded the PDF to proof read it as I am planning on using it for a class. I noticed an extra step as well as a couple changes I wanted to make in the instructions. I edited those, saved my corrections, and then re-downloaded the corrected PDF. The old errors are still showing up in the new download. How do you update the PDF file that is attached to the online instructable?

Posted by CrystalO14 7 months ago


Arduino

I am new in the programming stuff and i have, un familiar error problem. I hope you guys cold help me. thank for all the answers!!

Posted by ברקו 1 year ago